안도르이드 개발을 cocos2dx로 하고있는데 네트워크 부분에서 너무 막혀서 이렇게 올립니다.

 

libcurl이란 라이브러리를 쓰는것 까진 이해를 하였지만 사용해서 터미널로 빌드를 할시 에러가 뜹니다.

 

혹시나 다른 분들은 cocos2dx 네트워크를 어떻게 사용중이신가요?

 

다른 방법이 있다면 알려주시면 감사하겠습니다..ㅜ_ㅜ

 

제 개발환경은 윈도우 7 64bit환경에서 개발을 하고있습니다.

 

만약 libcurl을 사용하는게 맞다면 사용법좀 자세히 적어주시면 감사하겠습니다!

 

빌드시 에러가 어떻게 뜨는지 적어놓겠습니다^^

 


In file included from jni/../../Classes/curl/curl.h:35:0,
                 from jni/../../Classes/CurlTestScene.cpp:12:
jni/../../Classes/curl/curlrules.h:79:4: error: #error "CURL_SIZEOF_LONG definition is missing!"
jni/../../Classes/curl/curlrules.h:94:4: error: #error "CURL_TYPEOF_CURL_OFF_T definition is missing!"
jni/../../Classes/curl/curlrules.h:99:4: error: #error "CURL_FORMAT_CURL_OFF_T definition is missing!"
jni/../../Classes/curl/curlrules.h:104:4: error: #error "CURL_FORMAT_CURL_OFF_TU definition is missing!"
jni/../../Classes/curl/curlrules.h:109:4: error: #error "CURL_FORMAT_OFF_T definition is missing!"
jni/../../Classes/curl/curlrules.h:114:4: error: #error "CURL_SIZEOF_CURL_OFF_T definition is missing!"
jni/../../Classes/curl/curlrules.h:119:4: error: #error "CURL_SUFFIX_CURL_OFF_T definition is missing!"
jni/../../Classes/curl/curlrules.h:124:4: error: #error "CURL_SUFFIX_CURL_OFF_TU definition is missing!"
jni/../../Classes/curl/curlrules.h:80:4: error: 'Error' does not name a type
jni/../../Classes/curl/curlrules.h:153:6: error: 'curl_off_t' was not declared in this scope
jni/../../Classes/curl/curlrules.h:153:6: error: 'CURL_SIZEOF_CURL_OFF_T' was not declared in this scope
jni/../../Classes/curl/curlrules.h:163:6: error: 'curl_off_t' was not declared in this scope
In file included from jni/../../Classes/CurlTestScene.cpp:12:0:
jni/../../Classes/curl/curl.h:235:3: error: 'curl_off_t' does not name a type
jni/../../Classes/curl/curl.h:296:35: error: 'curl_off_t' has not been declared
/cygdrive/c/android-ndk-r7/build/core/build-binary.mk:249: recipe for target `obj/local/armeabi/objs-debug/game_logic_static/CurlTestScene.o' failed
make: *** [obj/local/armeabi/objs-debug/game_logic_static/CurlTestScene.o] Error 1
make: Leaving directory `/cygdrive/c/cocos2d/ex/android'

읽어주셔서 감사합니다..ㅠ_ㅠ